{"text_format":"1","workbook":"xlsx","n_sheets":7,"sheets":["Sheet1","INPUT","Sheet3","Sheet2","Sheet4","Order List","Export"],"not_rendered":{"charts":0,"images":59,"macros":1,"external_links":0,"defined_names":2,"comments":0,"pivot_tables":0},"unopened":[],"bounds":{"document_bytes":16777216,"sheet_cells":100000,"rows_first":2000,"rows_last":500,"rows_between":2000,"halvings":0,"cell_chars":16384,"cell_head_chars":4096},"cells_cut":0,"cells_raw":0,"read":"whole","date_system":"1900"}

{"sheet":"Sheet1","index":0,"n_rows":155,"n_cols":27,"rows_kept":155,"cut":false,"hidden":true,"merged":[[49,4,49,5],[49,6,49,7],[49,12,49,13],[49,14,49,15],[56,4,56,5],[56,6,56,7],[49,8,49,9],[49,10,49,11],[28,14,28,15],[28,12,28,13],[28,6,28,7],[28,4,28,5],[35,4,35,5],[35,6,35,7],[28,8,28,9],[28,10,28,11]]}
[null,false,{"$f":"IF(B1,12,IF(B2,19,IF(B3,22,28)))","v":22},false,null,false,{"$f":"IF(F1,\"Thunderbolt\",IF(F2,\"Cobra\",\"Trulock\"))","v":"Cobra"}]
[null,false,null,{"$f":"CONCATENATE(C1,\"mm\")","v":"22mm"},null,true]
[null,true,null,null,null,false]
[null,false]
[]
[null,false,{"$f":"IF(B6,35,IF(B7,45,55))","v":45},{"$f":"CONCATENATE(C6,\"mm\")","v":"45mm"},null,false,{"$f":"IF(F6,35,IF(F7,45,55))","v":45},{"$f":"CONCATENATE(G6,\"mm\")","v":"45mm"}]
[null,true,null,null,null,true]
[null,false,null,null,null,false]
[]
[null,false,{"$f":"IF(B10,\"RH\",\"LH\")","v":"LH"},{"$f":"C10","v":"LH"}]
[null,true]
[]
[null,true,false,{"$f":"IF(B13,\"Slave Only\",\"Slave and Master\")","v":"Slave Only"}]
[null,false]
[]
[null,"1050",null,{"$f":"CONCATENATE(B16,\"mm\")","v":"1050mm"}]
[null,"2100",null,{"$f":"CONCATENATE(B17,\"mm\")","v":"2100mm"}]
[]
[]
[null,null,null,"Min","Max",null,"Min","Max"]
{"$rows_left_out":136}
{"sheet":"INPUT","index":1,"n_rows":39,"n_cols":15,"rows_kept":39,"cut":false,"hidden":false,"merged":[]}
[]
[]
[]
[]
[]
[]
[]
[]
[]
[]
[]
[]
[]
[]
[]
[]
[]
[]
[]
[]
{"$rows_left_out":20}
{"sheet":"Sheet3","index":2,"n_rows":0,"n_cols":0,"rows_kept":0,"cut":false,"hidden":true,"merged":[]}

{"sheet":"Sheet2","index":3,"n_rows":91,"n_cols":6,"rows_kept":91,"cut":false,"hidden":true,"merged":[]}
[null,null,"Part Number","Description","Qty Per Door Set","Total Qty"]
[1,null,5016084,"MASTER FGTE LOCK THUNDERBOLT F20/45",1,1]
["22mm",null,5013845,"STV-FGTE Slave 2062-908/45 92/8 RH",1,1]
["45mm",null,2500480,"STV-A 175 Shootbolt",1,1]
["RH",null,2930754,"STV-A 372 Shootbolt",1,1]
["Slave Only",null,2933744,"F24 FGTE Shootbolt Keep Radius End",2,2]
["1050mm"]
["2100mm"]
[]
[]
[null,null,"Part Number","Description","Qty Per Door Set","Total Qty"]
[]
[]
[]
[]
[]
[]
[]
[]
[]
{"$rows_left_out":72}
{"sheet":"Sheet4","index":4,"n_rows":101,"n_cols":28,"rows_kept":101,"cut":false,"hidden":true,"merged":[]}
[null,null,null,{"$f":"INDIRECT(\"Sheet2!C1\")","v":"Part Number"},{"$f":"INDIRECT(\"Sheet2!D1\")","v":"Description"},{"$f":"INDIRECT(\"Sheet2!F1\")","v":"Total Qty"},null,null,null,null,null,null,null,null,null,null,null,null,null,null,"Part Number","Description","Total Qty",null,null,"Part Number","Description","Total Qty"]
[1,{"$f":"VALUE(CONCATENATE(IF(AND(D2>0,D2<9999999),D2,999999999),\".\",A2))","v":5016084.0999999996},null,{"$f":"INDIRECT(\"Sheet2!C2\")","v":5016084},{"$f":"INDIRECT(\"Sheet2!D2\")","v":"MASTER FGTE LOCK THUNDERBOLT F20/45"},{"$f":"INDIRECT(\"Sheet2!F2\")","v":1},null,null,{"$f":"SMALL(B:B,A2)","v":2500480.2999999998},1,{"$f":"IF(I2>999999999,\"\",VLOOKUP(I2,B:F,3,FALSE))","v":2500480},{"$f":"IF(I2>999999999,\"\",VLOOKUP(I2,B:F,4,FALSE))","v":"STV-A 175 Shootbolt"},{"$f":"IF(I2>999999999,\"\",VLOOKUP(I2,B:F,5,FALSE))","v":1},null,{"$f":"M2","v":1},{"$f":"IF(K2=K3,0,O2)","v":1},null,{"$f":"IF(P2=0,999,J2)","v":1},{"$f":"SMALL(R:R,J2)","v":1},{"$f":"IF(S2=999,999,COUNTIF($V$2:$V$41,\"<=\"&V2))","v":38},{"$f":"VLOOKUP(S2,J:P,2,FALSE)","v":2500480},{"$f":"VLOOKUP(S2,J:P,3,FALSE)","v":"STV-A 175 Shootbolt"},{"$f":"VLOOKUP(S2,J:P,7,FALSE)","v":1},null,{"$f":"SMALL(T:T,A2)","v":36},{"$f":"VLOOKUP(Y2,T:W,2,FALSE)","v":2933744},{"$f":"VLOOKUP(Y2,T:W,3,FALSE)","v":"F24 FGTE Shootbolt Keep Radius End"},{"$f":"VLOOKUP(Y2,T:W,4,FALSE)","v":2}]
[2,5013845.2,null,{"$f":"INDIRECT(\"Sheet2!C3\")","v":5013845},{"$f":"INDIRECT(\"Sheet2!D3\")","v":"STV-FGTE Slave 2062-908/45 92/8 RH"},{"$f":"INDIRECT(\"Sheet2!F3\")","v":1},null,null,2930754.4,2,2930754,"STV-A 372 Shootbolt",1,null,{"$f":"IF(K3=K2,M3+O2,M3)","v":1},{"$f":"IF(K3=K4,0,O3)","v":1},null,{"$f":"IF(P3=0,999,J3)","v":2},2,39,2930754,"STV-A 372 Shootbolt",1,null,37,{"$f":"VLOOKUP(Y3,T:W,2,FALSE)","v":5016084},{"$f":"VLOOKUP(Y3,T:W,3,FALSE)","v":"MASTER FGTE LOCK THUNDERBOLT F20/45"},{"$f":"VLOOKUP(Y3,T:W,4,FALSE)","v":1}]
[3,2500480.2999999998,null,{"$f":"INDIRECT(\"Sheet2!C4\")","v":2500480},{"$f":"INDIRECT(\"Sheet2!D4\")","v":"STV-A 175 Shootbolt"},{"$f":"INDIRECT(\"Sheet2!F4\")","v":1},null,null,2933744.5,3,2933744,"F24 FGTE Shootbolt Keep Radius End",2,null,{"$f":"IF(K4=K3,M4+O3,M4)","v":2},{"$f":"IF(K4=K5,0,O4)","v":2},null,3,3,36,2933744,"F24 FGTE Shootbolt Keep Radius End",2,null,38,2500480,"STV-A 175 Shootbolt",1]
[4,2930754.4,null,{"$f":"INDIRECT(\"Sheet2!C5\")","v":2930754},{"$f":"INDIRECT(\"Sheet2!D5\")","v":"STV-A 372 Shootbolt"},{"$f":"INDIRECT(\"Sheet2!F5\")","v":1},null,null,5013845.2,4,5013845,"STV-FGTE Slave 2062-908/45 92/8 RH",1,null,1,1,null,4,4,40,5013845,"STV-FGTE Slave 2062-908/45 92/8 RH",1,null,39,2930754,"STV-A 372 Shootbolt",1]
[5,2933744.5,null,{"$f":"INDIRECT(\"Sheet2!C6\")","v":2933744},{"$f":"INDIRECT(\"Sheet2!D6\")","v":"F24 FGTE Shootbolt Keep Radius End"},{"$f":"INDIRECT(\"Sheet2!F6\")","v":2},null,null,5016084.0999999996,5,5016084,"MASTER FGTE LOCK THUNDERBOLT F20/45",1,null,1,1,null,5,5,37,5016084,"MASTER FGTE LOCK THUNDERBOLT F20/45",1,null,40,5013845,"STV-FGTE Slave 2062-908/45 92/8 RH",1]
[6,999999999.60000002,null,{"$f":"INDIRECT(\"Sheet2!C7\")","v":0},{"$f":"INDIRECT(\"Sheet2!D7\")","v":0},{"$f":"INDIRECT(\"Sheet2!F7\")","v":0},null,null,999999999.10000002,6,"","","",null,"",0,null,999,999,999,"","","",null,999,"","",""]
[7,999999999.70000005,null,{"$f":"INDIRECT(\"Sheet2!C8\")","v":0},{"$f":"INDIRECT(\"Sheet2!D8\")","v":0},{"$f":"INDIRECT(\"Sheet2!F8\")","v":0},null,null,999999999.10000002,7,"","","",null,{"$error":"#VALUE!"},0,null,999,999,999,"","","",null,999,"","",""]
[8,999999999.79999995,null,{"$f":"INDIRECT(\"Sheet2!C9\")","v":0},{"$f":"INDIRECT(\"Sheet2!D9\")","v":0},{"$f":"INDIRECT(\"Sheet2!F9\")","v":0},null,null,999999999.11000001,8,"","","",null,{"$error":"#VALUE!"},0,null,999,999,999,"","","",null,999,"","",""]
[9,999999999.89999998,null,{"$f":"INDIRECT(\"Sheet2!C10\")","v":0},{"$f":"INDIRECT(\"Sheet2!D10\")","v":0},{"$f":"INDIRECT(\"Sheet2!F10\")","v":0},null,null,999999999.12,9,"","","",null,{"$error":"#VALUE!"},0,null,999,999,999,"","","",null,999,"","",""]
[10,999999999.10000002,null,{"$f":"INDIRECT(\"Sheet2!C11\")","v":"Part Number"},{"$f":"INDIRECT(\"Sheet2!D11\")","v":"Description"},{"$f":"INDIRECT(\"Sheet2!F11\")","v":"Total Qty"},null,null,999999999.13,10,"","","",null,{"$error":"#VALUE!"},0,null,999,999,999,"","","",null,999,"","",""]
[11,999999999.11000001,null,{"$f":"INDIRECT(\"Sheet2!C12\")","v":0},{"$f":"INDIRECT(\"Sheet2!D12\")","v":0},{"$f":"INDIRECT(\"Sheet2!F12\")","v":0},null,null,999999999.13999999,11,"","","",null,{"$error":"#VALUE!"},0,null,999,999,999,"","","",null,999,"","",""]
[12,999999999.12,null,{"$f":"INDIRECT(\"Sheet2!C13\")","v":0},{"$f":"INDIRECT(\"Sheet2!D13\")","v":0},{"$f":"INDIRECT(\"Sheet2!F13\")","v":0},null,null,999999999.14999998,12,"","","",null,{"$error":"#VALUE!"},0,null,999,999,999,"","","",null,999,"","",""]
[13,999999999.13,null,{"$f":"INDIRECT(\"Sheet2!C14\")","v":0},{"$f":"INDIRECT(\"Sheet2!D14\")","v":0},{"$f":"INDIRECT(\"Sheet2!F14\")","v":0},null,null,999999999.15999997,13,"","","",null,{"$f":"IF(K14=K13,M14+O13,M14)","v":{"$error":"#VALUE!"}},0,null,999,999,999,"","","",null,999,"","",""]
[14,999999999.13999999,null,{"$f":"INDIRECT(\"Sheet2!C15\")","v":0},{"$f":"INDIRECT(\"Sheet2!D15\")","v":0},{"$f":"INDIRECT(\"Sheet2!F15\")","v":0},null,null,999999999.16999996,14,"","","",null,{"$error":"#VALUE!"},0,null,999,999,999,"","","",null,999,"","",""]
[15,999999999.14999998,null,{"$f":"INDIRECT(\"Sheet2!C16\")","v":0},{"$f":"INDIRECT(\"Sheet2!D16\")","v":0},{"$f":"INDIRECT(\"Sheet2!F16\")","v":0},null,null,999999999.17999995,15,"","","",null,{"$f":"IF(K16=K15,M16+O15,M16)","v":{"$error":"#VALUE!"}},0,null,999,999,999,"","","",null,999,"","",""]
[16,999999999.15999997,null,{"$f":"INDIRECT(\"Sheet2!C17\")","v":0},{"$f":"INDIRECT(\"Sheet2!D17\")","v":0},{"$f":"INDIRECT(\"Sheet2!F17\")","v":0},null,null,999999999.19000006,16,"","","",null,{"$error":"#VALUE!"},0,null,999,999,999,"","","",null,999,"","",""]
[17,999999999.16999996,null,{"$f":"INDIRECT(\"Sheet2!C18\")","v":0},{"$f":"INDIRECT(\"Sheet2!D18\")","v":0},{"$f":"INDIRECT(\"Sheet2!F18\")","v":0},null,null,999999999.20000005,17,"","","",null,{"$error":"#VALUE!"},0,null,999,999,999,"","","",null,999,"","",""]
[18,999999999.17999995,null,{"$f":"INDIRECT(\"Sheet2!C19\")","v":0},{"$f":"INDIRECT(\"Sheet2!D19\")","v":0},{"$f":"INDIRECT(\"Sheet2!F19\")","v":0},null,null,999999999.21000004,18,"","","",null,{"$error":"#VALUE!"},0,null,999,999,999,"","","",null,999,"","",""]
[19,999999999.19000006,null,{"$f":"INDIRECT(\"Sheet2!C20\")","v":0},{"$f":"INDIRECT(\"Sheet2!D20\")","v":0},{"$f":"INDIRECT(\"Sheet2!F20\")","v":0},null,null,999999999.22000003,19,"","","",null,{"$error":"#VALUE!"},0,null,999,999,999,"","","",null,999,"","",""]
{"$rows_left_out":82}
{"sheet":"Order List","index":5,"n_rows":107,"n_cols":12,"rows_kept":107,"cut":false,"hidden":true,"merged":[]}
[]
[]
[]
[]
[]
[null,"TOTAL ORDER QUANTITY",null,null,null,"ITEMISED PARTS"]
[]
[null,"Part Number","Description","Total Qty",null,{"$f":"IF(G8=\"\",\"\",\"Quantity\")","v":"Quantity"},{"$f":"IF(INDIRECT(\"sheet2!A2\")=0,\"\",INDIRECT(\"sheet2!A2\"))","v":1},null,{"$f":"IF(INDIRECT(\"sheet2!C2\")=0,\"\",INDIRECT(\"sheet2!C1\"))","v":"Part Number"},{"$f":"IF(INDIRECT(\"sheet2!D2\")=0,\"\",INDIRECT(\"sheet2!D1\"))","v":"Description"},{"$f":"IF(INDIRECT(\"sheet2!E2\")=0,\"\",INDIRECT(\"sheet2!E1\"))","v":"Qty Per Door Set"},{"$f":"IF(INDIRECT(\"sheet2!F2\")=0,\"\",INDIRECT(\"sheet2!F1\"))","v":"Total Qty"}]
[null,{"$f":"Sheet4!Z2","v":2933744},{"$f":"Sheet4!AA2","v":"F24 FGTE Shootbolt Keep Radius End"},{"$f":"Sheet4!AB2","v":2},null,{"$f":"IF(G9=\"\",\"\",\"Lock Centre Line\")","v":"Lock Centre Line"},{"$f":"IF(INDIRECT(\"sheet2!A3\")=0,\"\",INDIRECT(\"sheet2!A3\"))","v":"22mm"},null,{"$f":"IF(INDIRECT(\"sheet2!C2\")=0,\"\",INDIRECT(\"sheet2!C2\"))","v":5016084},{"$f":"IF(INDIRECT(\"sheet2!D2\")=0,\"\",INDIRECT(\"sheet2!D2\"))","v":"MASTER FGTE LOCK THUNDERBOLT F20/45"},{"$f":"IF(INDIRECT(\"sheet2!E2\")=0,\"\",INDIRECT(\"sheet2!E2\"))","v":1},{"$f":"IF(INDIRECT(\"sheet2!F2\")=0,\"\",INDIRECT(\"sheet2!F2\"))","v":1}]
[null,{"$f":"Sheet4!Z3","v":5016084},{"$f":"Sheet4!AA3","v":"MASTER FGTE LOCK THUNDERBOLT F20/45"},{"$f":"Sheet4!AB3","v":1},null,{"$f":"IF(G10=\"\",\"\",\"Slave Backset\")","v":"Slave Backset"},{"$f":"IF(INDIRECT(\"sheet2!A4\")=0,\"\",INDIRECT(\"sheet2!A4\"))","v":"45mm"},null,{"$f":"IF(INDIRECT(\"sheet2!C3\")=0,\"\",INDIRECT(\"sheet2!C3\"))","v":5013845},{"$f":"IF(INDIRECT(\"sheet2!D3\")=0,\"\",INDIRECT(\"sheet2!D3\"))","v":"STV-FGTE Slave 2062-908/45 92/8 RH"},{"$f":"IF(INDIRECT(\"sheet2!E3\")=0,\"\",INDIRECT(\"sheet2!E3\"))","v":1},{"$f":"IF(INDIRECT(\"sheet2!F3\")=0,\"\",INDIRECT(\"sheet2!F3\"))","v":1}]
[null,{"$f":"Sheet4!Z4","v":2500480},{"$f":"Sheet4!AA4","v":"STV-A 175 Shootbolt"},{"$f":"Sheet4!AB4","v":1},null,{"$f":"IF(G11=\"\",\"\",\"Handing\")","v":"Handing"},{"$f":"IF(INDIRECT(\"sheet2!A5\")=0,\"\",INDIRECT(\"sheet2!A5\"))","v":"RH"},null,{"$f":"IF(INDIRECT(\"sheet2!C4\")=0,\"\",INDIRECT(\"sheet2!C4\"))","v":2500480},{"$f":"IF(INDIRECT(\"sheet2!D4\")=0,\"\",INDIRECT(\"sheet2!D4\"))","v":"STV-A 175 Shootbolt"},{"$f":"IF(INDIRECT(\"sheet2!E4\")=0,\"\",INDIRECT(\"sheet2!E4\"))","v":1},{"$f":"IF(INDIRECT(\"sheet2!F4\")=0,\"\",INDIRECT(\"sheet2!F4\"))","v":1}]
[null,{"$f":"Sheet4!Z5","v":2930754},{"$f":"Sheet4!AA5","v":"STV-A 372 Shootbolt"},{"$f":"Sheet4!AB5","v":1},null,{"$f":"IF(G12=\"\",\"\",\"Shootbolt Options\")","v":"Shootbolt Options"},{"$f":"IF(INDIRECT(\"sheet2!A6\")=0,\"\",INDIRECT(\"sheet2!A6\"))","v":"Slave Only"},null,{"$f":"IF(INDIRECT(\"sheet2!C5\")=0,\"\",INDIRECT(\"sheet2!C5\"))","v":2930754},{"$f":"IF(INDIRECT(\"sheet2!D5\")=0,\"\",INDIRECT(\"sheet2!D5\"))","v":"STV-A 372 Shootbolt"},{"$f":"IF(INDIRECT(\"sheet2!E5\")=0,\"\",INDIRECT(\"sheet2!E5\"))","v":1},{"$f":"IF(INDIRECT(\"sheet2!F5\")=0,\"\",INDIRECT(\"sheet2!F5\"))","v":1}]
[null,{"$f":"Sheet4!Z6","v":5013845},{"$f":"Sheet4!AA6","v":"STV-FGTE Slave 2062-908/45 92/8 RH"},{"$f":"Sheet4!AB6","v":1},null,{"$f":"IF(G13=\"\",\"\",\"Handle Height\")","v":"Handle Height"},{"$f":"IF(INDIRECT(\"sheet2!A7\")=0,\"\",INDIRECT(\"sheet2!A7\"))","v":"1050mm"},null,{"$f":"IF(INDIRECT(\"sheet2!C6\")=0,\"\",INDIRECT(\"sheet2!C6\"))","v":2933744},{"$f":"IF(INDIRECT(\"sheet2!D6\")=0,\"\",INDIRECT(\"sheet2!D6\"))","v":"F24 FGTE Shootbolt Keep Radius End"},{"$f":"IF(INDIRECT(\"sheet2!E6\")=0,\"\",INDIRECT(\"sheet2!E6\"))","v":2},{"$f":"IF(INDIRECT(\"sheet2!F6\")=0,\"\",INDIRECT(\"sheet2!F6\"))","v":2}]
[null,{"$f":"Sheet4!Z7","v":""},{"$f":"Sheet4!AA7","v":""},{"$f":"Sheet4!AB7","v":""},null,{"$f":"IF(G14=\"\",\"\",\"Door Rebate Height\")","v":"Door Rebate Height"},{"$f":"IF(INDIRECT(\"sheet2!A8\")=0,\"\",INDIRECT(\"sheet2!A8\"))","v":"2100mm"},null,{"$f":"IF(INDIRECT(\"sheet2!C7\")=0,\"\",INDIRECT(\"sheet2!C7\"))","v":""},{"$f":"IF(INDIRECT(\"sheet2!D7\")=0,\"\",INDIRECT(\"sheet2!D7\"))","v":""},{"$f":"IF(INDIRECT(\"sheet2!E7\")=0,\"\",INDIRECT(\"sheet2!E7\"))","v":""},{"$f":"IF(INDIRECT(\"sheet2!F7\")=0,\"\",INDIRECT(\"sheet2!F7\"))","v":""}]
[null,{"$f":"Sheet4!Z8","v":""},{"$f":"Sheet4!AA8","v":""},{"$f":"Sheet4!AB8","v":""},null,null,null,null,{"$f":"IF(INDIRECT(\"sheet2!C8\")=0,\"\",INDIRECT(\"sheet2!C8\"))","v":""},{"$f":"IF(INDIRECT(\"sheet2!D8\")=0,\"\",INDIRECT(\"sheet2!D8\"))","v":""},{"$f":"IF(INDIRECT(\"sheet2!E8\")=0,\"\",INDIRECT(\"sheet2!E8\"))","v":""},{"$f":"IF(INDIRECT(\"sheet2!F8\")=0,\"\",INDIRECT(\"sheet2!F8\"))","v":""}]
[null,{"$f":"Sheet4!Z9","v":""},{"$f":"Sheet4!AA9","v":""},{"$f":"Sheet4!AB9","v":""},null,null,null,null,{"$f":"IF(INDIRECT(\"sheet2!C9\")=0,\"\",INDIRECT(\"sheet2!C9\"))","v":""},{"$f":"IF(INDIRECT(\"sheet2!D9\")=0,\"\",INDIRECT(\"sheet2!D9\"))","v":""},{"$f":"IF(INDIRECT(\"sheet2!E9\")=0,\"\",INDIRECT(\"sheet2!E9\"))","v":""},{"$f":"IF(INDIRECT(\"sheet2!F9\")=0,\"\",INDIRECT(\"sheet2!F9\"))","v":""}]
[null,{"$f":"Sheet4!Z10","v":""},{"$f":"Sheet4!AA10","v":""},{"$f":"Sheet4!AB10","v":""},null,null,null,null,{"$f":"IF(INDIRECT(\"sheet2!C10\")=0,\"\",INDIRECT(\"sheet2!C10\"))","v":""},{"$f":"IF(INDIRECT(\"sheet2!D10\")=0,\"\",INDIRECT(\"sheet2!D10\"))","v":""},{"$f":"IF(INDIRECT(\"sheet2!E10\")=0,\"\",INDIRECT(\"sheet2!E10\"))","v":""},{"$f":"IF(INDIRECT(\"sheet2!F10\")=0,\"\",INDIRECT(\"sheet2!F10\"))","v":""}]
[null,{"$f":"Sheet4!Z11","v":""},{"$f":"Sheet4!AA11","v":""},{"$f":"Sheet4!AB11","v":""},null,{"$f":"IF(G18=\"\",\"\",\"Quantity\")","v":""},{"$f":"IF(INDIRECT(\"sheet2!A12\")=0,\"\",INDIRECT(\"sheet2!A12\"))","v":""},null,{"$f":"IF(INDIRECT(\"sheet2!C12\")=0,\"\",INDIRECT(\"sheet2!C11\"))","v":""},{"$f":"IF(INDIRECT(\"sheet2!D12\")=0,\"\",INDIRECT(\"sheet2!D11\"))","v":""},{"$f":"IF(INDIRECT(\"sheet2!E12\")=0,\"\",INDIRECT(\"sheet2!E11\"))","v":""},{"$f":"IF(INDIRECT(\"sheet2!F12\")=0,\"\",INDIRECT(\"sheet2!F11\"))","v":""}]
[null,{"$f":"Sheet4!Z12","v":""},{"$f":"Sheet4!AA12","v":""},{"$f":"Sheet4!AB12","v":""},null,{"$f":"IF(G19=\"\",\"\",\"Lock Centre Line\")","v":""},{"$f":"IF(INDIRECT(\"sheet2!A13\")=0,\"\",INDIRECT(\"sheet2!A13\"))","v":""},null,{"$f":"IF(INDIRECT(\"sheet2!C12\")=0,\"\",INDIRECT(\"sheet2!C12\"))","v":""},{"$f":"IF(INDIRECT(\"sheet2!D12\")=0,\"\",INDIRECT(\"sheet2!D12\"))","v":""},{"$f":"IF(INDIRECT(\"sheet2!E12\")=0,\"\",INDIRECT(\"sheet2!E12\"))","v":""},{"$f":"IF(INDIRECT(\"sheet2!F12\")=0,\"\",INDIRECT(\"sheet2!F12\"))","v":""}]
[null,{"$f":"Sheet4!Z13","v":""},{"$f":"Sheet4!AA13","v":""},{"$f":"Sheet4!AB13","v":""},null,{"$f":"IF(G20=\"\",\"\",\"Slave Backset\")","v":""},{"$f":"IF(INDIRECT(\"sheet2!A14\")=0,\"\",INDIRECT(\"sheet2!A14\"))","v":""},null,{"$f":"IF(INDIRECT(\"sheet2!C13\")=0,\"\",INDIRECT(\"sheet2!C13\"))","v":""},{"$f":"IF(INDIRECT(\"sheet2!D13\")=0,\"\",INDIRECT(\"sheet2!D13\"))","v":""},{"$f":"IF(INDIRECT(\"sheet2!E13\")=0,\"\",INDIRECT(\"sheet2!E13\"))","v":""},{"$f":"IF(INDIRECT(\"sheet2!F13\")=0,\"\",INDIRECT(\"sheet2!F13\"))","v":""}]
{"$rows_left_out":88}
{"sheet":"Export","index":6,"n_rows":107,"n_cols":12,"rows_kept":107,"cut":false,"hidden":true,"merged":[]}
[null,"FGTE Configurator (Oct 2014).xlsm"]
[]
[]
[]
[]
[null,"TOTAL ORDER QUANTITY",null,null,null,"ITEMISED PARTS"]
[]
[null,"Part Number","Description","Total Qty",null,"Quantity",1,null,"Part Number","Description","Qty Per Door Set","Total Qty"]
[null,2933744,"F24 FGTE Shootbolt Keep Radius End",2,null,"Lock Centre Line","22mm",null,5016084,"MASTER FGTE LOCK THUNDERBOLT F20/45",1,1]
[null,5016084,"MASTER FGTE LOCK THUNDERBOLT F20/45",1,null,"Slave Backset","45mm",null,5013845,"STV-FGTE Slave 2062-908/45 92/8 RH",1,1]
[null,2500480,"STV-A 175 Shootbolt",1,null,"Handing","RH",null,2500480,"STV-A 175 Shootbolt",1,1]
[null,2930754,"STV-A 372 Shootbolt",1,null,"Shootbolt Options","Slave Only",null,2930754,"STV-A 372 Shootbolt",1,1]
[null,5013845,"STV-FGTE Slave 2062-908/45 92/8 RH",1,null,"Handle Height","1050mm",null,2933744,"F24 FGTE Shootbolt Keep Radius End",2,2]
[null,"","","",null,"Door Rebate Height","2100mm",null,"","","",""]
[null,"","","",null,null,null,null,"","","",""]
[null,"","","",null,null,null,null,"","","",""]
[null,"","","",null,null,null,null,"","","",""]
[null,"","","",null,"","",null,"","","",""]
[null,"","","",null,"","",null,"","","",""]
[null,"","","",null,"","",null,"","","",""]
{"$rows_left_out":87}